{"text_format":"3","workbook":"xlsx","n_sheets":9,"sheets":["basis","aanvoer gewas","aanvoer mest","aanvoer compost","aanvoer groenbemesters","resultaat","totaal overzicht OSBalans","totaal overzicht Nmineralisatie","tabellen"],"not_rendered":{"images":8,"defined_names":9},"read":"whole","date_system":"1900"}

{"sheet":"basis","index":0,"n_rows":48,"n_cols":4,"rows_kept":48,"merged":[[1,1,1,4],[4,1,4,4],[7,2,7,3],[8,2,8,3],[9,2,9,3],[12,2,12,3]]}
[]
[null,"ORGANISCHE STOFBALANS"]
[]
[]
[null,"basisgegevens"]
[]
{"$rows_left_out":14}
{"sheet":"aanvoer gewas","index":1,"n_rows":30,"n_cols":7,"rows_kept":30,"merged":[[1,0,1,6],[9,6,10,6],[11,6,13,6],[14,6,16,6]]}
[]
["ORGANISCHE STOFBALANS"]
[]
[null,"aanvoer gewasresten"]
[]
[null,"vul een volledige rotatie in"]
{"$rows_left_out":25}
{"sheet":"aanvoer mest","index":2,"n_rows":24,"n_cols":11,"rows_kept":24,"merged":[[1,1,1,9],[5,3,5,5],[5,6,5,8]]}
[]
[null,"ORGANISCHE STOFBALANS"]
[]
[null,"aanvoer organische mest"]
[]
[{"$nulls":3},"organische mest voorjaar",null,null,"organische mest najaar"]
{"$rows_left_out":19}
{"sheet":"aanvoer compost","index":3,"n_rows":24,"n_cols":11,"rows_kept":24,"merged":[[1,1,1,9],[5,3,5,5],[5,6,5,8]]}
[]
[null,"ORGANISCHE STOFBALANS"]
[]
[null,"aanvoer compost"]
[]
[{"$nulls":3},"compost voorjaar",null,null,"compost najaar"]
{"$rows_left_out":19}
{"sheet":"aanvoer groenbemesters","index":4,"n_rows":29,"n_cols":6,"rows_kept":29,"merged":[[1,1,1,4]]}
[]
[null,"ORGANISCHE STOFBALANS"]
[]
[null,"aanvoer groenbemesters"]
[]
[null,"jaar","gewas","soort groenbemester","aanvoer eff. org. stof (kg/ha)","beschikbare N (kg/ha)"]
{"$rows_left_out":16}
{"sheet":"resultaat","index":5,"n_rows":40,"n_cols":6,"rows_kept":40,"merged":[[1,1,1,5],[6,3,6,5],[20,4,20,5],[22,1,24,5]]}
[]
[null,"ORGANISCHE STOFBALANS"]
[]
[null,"resultaat organische stofbalans"]
[]
[]
{"$rows_left_out":20}
{"sheet":"totaal overzicht OSBalans","index":6,"n_rows":24,"n_cols":13,"rows_kept":24,"merged":[[3,2,3,3],[3,4,3,6],[3,7,3,9],[3,10,3,11],[22,9,22,10],[23,1,23,12]]}
[null,"organische stofbalans"]
[null,{"$f":"\"perceel: \"&basis!C13","v":"perceel: "}]
[]
[null,null,"gewasaanvoer",null,"aanvoer mest",null,null,"aanvoer compost",null,null,"aanvoer groenbemester",null,"totaal"]
[{"$nulls":3},"eff.org.stof per hectare","soort mest","ton per ha","eff.org.stof per hectare","soort compost","ton per ha","eff.org.stof per hectare","soort groenbem.","eff.org.stof per hectare","eff.org.stof per hectare"]
[null,{"$f":"'aanvoer gewas'!B10","v":2012},{"$f":"IF('aanvoer gewas'!C10=\"\",\"\",'aanvoer gewas'!C10)","v":""},{"$f":"IF(C6=\"\",0,VLOOKUP(C6,tabellen!E$3:F$197,2))","v":0},{"$f":"IF(AND('aanvoer mest'!D8=\"\",'aanvoer mest'!G8=\"\"),\"\",IF(AND('aanvoer mest'!D8=\"\",'aanvoer mest'!G8<>\"\"),'aanvoer mest'!G8,IF(AND('aanvoer mest'!G8=\"\",'aanvoer mest'!D8<>\"\"),'aanvoer mest'!D8,'aanvoer mest'!D8&\" / \"&'aanvoer mest'!G8)))","v":""},{"$f":"IF(AND('aanvoer mest'!D8=\"\",'aanvoer mest'!G8=\"\"),\"\",IF(AND('aanvoer mest'!D8=\"\",'aanvoer mest'!G8<>\"\"),'aanvoer mest'!H8,IF(AND('aanvoer mest'!G8=\"\",'aanvoer mest'!D8<>\"\"),'aanvoer mest'!E8,'aanvoer mest'!E8&\" / \"&'aanvoer mest'!H8)))","v":""},{"$f":"IF(E6=\"\",0,'aanvoer mest'!J8)","v":0},{"$f":"IF(AND('aanvoer compost'!D8=\"\",'aanvoer compost'!G8=\"\"),\"\",IF(AND('aanvoer compost'!D8=\"\",'aanvoer compost'!G8<>\"\"),'aanvoer compost'!G8,IF(AND('aanvoer compost'!G8=\"\",'aanvoer compost'!D8<>\"\"),'aanvoer compost'!D8,'aanvoer compost'!D8&\" / \"&'aanvoer compost'!G8)))","v":""},{"$f":"IF(AND('aanvoer compost'!D8=\"\",'aanvoer compost'!G8=\"\"),\"\",IF(AND('aanvoer compost'!D8=\"\",'aanvoer compost'!G8<>\"\"),'aanvoer compost'!H8,IF(AND('aanvoer compost'!G8=\"\",'aanvoer compost'!D8<>\"\"),'aanvoer compost'!E8,'aanvoer compost'!E8&\" / \"&'aanvoer compost'!H8)))","v":""},{"$f":"IF(H6=\"\",0,'aanvoer compost'!J8)","v":0},{"$f":"IF('aanvoer groenbemesters'!D7=\"\",\"\",'aanvoer groenbemesters'!D7)","v":""},{"$f":"IF(K6=\"\",0,VLOOKUP(K6,tabellen!X$3:Y$22,2))","v":0},{"$f":"IF(D6+G6+J6+L6=0,\"\",D6+G6+J6+L6)","v":""}]
{"$rows_left_out":19}
{"sheet":"totaal overzicht Nmineralisatie","index":7,"n_rows":21,"n_cols":21,"rows_kept":21,"merged":[[3,1,5,1],[3,3,3,12],[3,13,3,18],[3,19,4,20],[4,3,4,4],[4,5,4,7],[4,8,4,10],[4,11,4,12],[4,13,4,15],[4,16,4,18],[19,3,19,4],[20,1,20,20]]}
[null,"N-mineralisatie"]
[null,{"$f":"\"perceel: \"&basis!C13","v":"perceel: "}]
[]
[{"$nulls":3},"N-levering uit aanvoer voorgaand jaar",{"$nulls":9},"N-levering uit aanvoer huidig jaar",{"$nulls":5},"totale N-levering tijdens groeiseizoen"]
[{"$nulls":3},"voorvrucht",null,"aanvoer mest",null,null,"aanvoer compost",null,null,"aanvoer groenbemester",null,"aanvoer mest",null,null,"aanvoer compost"]
[null,null,"gewas","voorvrucht","beschikbare N (kg/ha)","mest najaar","ton per ha","beschikbare N (kg/ha)","compost najaar","ton per ha","beschikbare N (kg/ha)","groen-bemester najaar","beschikbare N (kg/ha)","mest voorjaar","ton per ha","beschikbare N (kg/ha)","compost voorjaar","ton per ha","beschikbare N (kg/ha)","beschikbare N (excl. bodem org. stof) (kg/ha)","beschikbare N (incl. bodem org. stof) (kg/ha)"]
{"$rows_left_out":16}
{"sheet":"tabellen","index":8,"n_rows":200,"n_cols":30,"rows_kept":200,"hidden":true,"merged":[[0,11,0,13],[0,19,0,21],[198,4,198,5]]}
[null,"afbraak organische stof",null,null,"levering effectieve organische stof door gewasresten",{"$nulls":3},"levering effectieve organische stof door organische mest",null,null,"Stikstof",{"$nulls":4},"levering effectieve organische stof door compost",null,null,"Stikstof",{"$nulls":3},"levering effectieve organische stof door groenbemesters",null,"Stikstof",null,"jaar aflopend sorteren",null,true]
[null,"os%","jaarlijkse afbraak",null,"gewas","levering effectieve organische stof door gewasresten (kg per hectare)","N-Levering",null,"mestsoort","afk","effectieve org. stof per ton produkt","Kg N per ton/m³","w.c. N nj","w.c. N vj",null,null,"compostsoort","afk","effectieve org. stof per ton produkt","Kg N per ton/m³","w.c. N nj","w.c. N vj",null,"groenbemesters (in de stoppel gezaaid)","levering effectieve organische stof door gewasresten (kg per hectare)","mineralisatie"]
[null,2,{"$f":"1479*LN(B3) - 329.93","v":{"v":695.2346800481589,"d":"695"}},{"$nulls":5},"(geen mest)",null,0,{"$nulls":5},"(geen compost)",null,0,{"$nulls":4},"(geen groenbemester)",0]
[null,3,{"v":1294.9175749401343,"d":"1295"},null,"Aardbeien",300,0,null,"Droge hennenmest (vast)","V-HEN",190,{"v":24.099999999999998,"d":"24.1"},0.25,0.58,null,null,"AVEBE-compost","AVEBE",110,3.3,0.1,0.1,null,"Bladkool",840,30]
[null,4,{"v":1720.3993600963179,"d":"1720"},null,"Achillea",0,0,null,"Eendenmest (vast)","V-EEN",105,{"v":8.299999999999999,"d":"8.3"},0.25,0.55,null,null,"Champost","CHAM",126,5.2,0.1,0.25,null,"Bladrammenas",850,30]
[null,5,{"v":2050.4286724900344,"d":"2050"},null,"Aconitum (monnikskap)",0,0,null,"Geitenmest (vast)","V-GEIT",90,8.5,0.25,0.65,null,null,"GFT-compost","GFT",183,6.9,0.1,0.1,null,"Gele mosterd",850,30]
{"$rows_left_out":194}